Forum OpenACS Development: Re: Next Bug Stomp 10/11 august

Collapse
Posted by Emmanuelle Raffenne on
For next bug stomp (10/11 aug), we (uned) can provide a oracle server (9i). After the bug stomp, this server can be used for testing purpose.
Collapse
Posted by Rocael Hernández Rizzardini on
good, please set up everything in advance, so you can run tests in oracle while new tests are commited, I guess someone from your side will be participating in the bug-stomp.
Collapse
Posted by Emmanuelle Raffenne on

Oracle test server is available at http://openacs.innova.uned.es. Ping me in IRC for access.

During the installation, there was 1 error:

# Installing Search 5.3.0d1
# Installing data model for Search 5.3.0d1...

    * Loading data model /web/openacs/packages/search/sql/oracle/search-create.sql...

          SQL*Plus: Release 9.2.0.4.0 - Production on Wed Aug 9 19:04:15 2006
          Copyright (c) 1982, 2002, Oracle Corporation.  All rights reserved.
          Connected to:
          Oracle9i Enterprise Edition Release 9.2.0.4.0 - Production
          With the Partitioning and Oracle Data Mining options
          JServer Release 9.2.0.4.0 - Production

          				references dotlrn_communities_all
                                                     *
          ERROR at line 22:
          ORA-00942: table or view does not exist
          Table created.
          Table created.
          Disconnected from Oracle9i Enterprise Edition Release 9.2.0.4.0 - Production
          With the Partitioning and Oracle Data Mining options
          JServer Release 9.2.0.4.0 - Production

Installed Search, version 5.3.0d1.
Package enabled.

The result of the tests are the following:

Package keyTestcases runPassesFailsResult
acs-admin 2 3 0 OK
acs-api-browser 1 1 0 OK
acs-authentication 24 229 0 OK
acs-automated-testing 1 0 0 OK
acs-content-repository 7 39 1 FAILED
acs-lang 15 357 0 OK
acs-mail 1 2 0 OK
acs-messaging 2 2 0 OK
acs-service-contract 1 1 0 OK
acs-subsite 3 3 1 FAILED
acs-tcl 53 297 95 FAILED
acs-templating 6 41 10 FAILED